Pytest(1)安装与入门「建议收藏」

Pytest(1)安装与入门「建议收藏」pytest介绍pytest是python的一种单元测试框架,与python自带的unittest测试框架类似,但是比unittest框架使用起来更简洁,效率更高。根据pytest的官方网站介绍,它


Jetbrains全系列IDE使用 1年只要46元 售后保障 童叟无欺

pytest介绍

pytest是python的一种单元测试框架,与python自带的unittest测试框架类似,但是比unittest框架使用起来更简洁,效率更高。根据pytest的官方网站介绍,它具有如下特点:

  1. 非常容易上手,入门简单,文档丰富,文档中有很多实例可以参考
  2. 能够支持简单的单元测试和复杂的功能测试
  3. 支持参数化
  4. 执行测试过程中可以将某些测试跳过(skip),或者对某些预期失败的case标记成失败
  5. 支持重复执行(rerun)失败的 case
  6. 支持运行由 nose, unittest 编写的测试 case
  7. 可生成 html 报告
  8. 方便的和持续集成工具 jenkins 集成
  9. 可支持执行部分用例
  10. 具有很多第三方插件,并且可以自定义扩展
     

安装pytest

一般接触一个新的框架,个人推荐使用virtualenvwrapper这个虚拟环境,使得环境独立
有关virtualenvwrapper的安装与使用后续再出文章,这里可自行百度

终端运行

(pytest_env) ➜  ~ pip3 install pytest

查看版本

(pytest_env) ➜  ~ pytest --version             

 

快速开始

# test_sample.py 的内容 
def func(x):
  return x + 1


def test_answer():
  assert func(3) == 5


class TestClass(object):
  def test_one(self):
    x = "this"
    assert 'h' in x

  def test_two(self):
    x = "hello"
    assert hasattr(x, 'check')

然后进入当前目录,执行命令pytest

> pytest

============================================= test session starts =============================================
platform darwin -- Python 3.7.6, pytest-6.2.1, py-1.10.0, pluggy-0.13.0
rootdir: /Users/jkc/PycharmProjects/pytestDoc
plugins: allure-pytest-2.8.6
collected 3 items                                                                                             

test_example.py F.F                                                                                     [100%]

================================================== FAILURES ===================================================
_________________________________________________ test_answer _________________________________________________

    def test_answer():
>     assert func(3) == 5
E     assert 4 == 5
E      +  where 4 = func(3)

test_example.py:16: AssertionError
_____________________________________________ TestClass.test_two ______________________________________________

self = <test_example.TestClass object at 0x7fe3e6ff7990>

    def test_two(self):
      x = "hello"
>     assert hasattr(x, 'check')
E     AssertionError: assert False
E      +  where False = hasattr('hello', 'check')

test_example.py:26: AssertionError
=========================================== short test summary info ===========================================
FAILED test_example.py::test_answer - assert 4 == 5
FAILED test_example.py::TestClass::test_two - AssertionError: assert False
========================================= 2 failed, 1 passed in 0.04s =========================================

 

知识点

  • 如果只执行 pytest ,会查找当前目录及其子目录下以test__*.py或 *_test.py 文件,找到文件后,在文件中找到以 test 开头函数或者Test开头的类并执行(当然,后续也可以自定义规则)
  • 如果只想执行某个文件,可以pytest start.py
  • 加上-q,就是显示简单的结果:pytest -q start.py

 

Pytest用例的设计原则

用Pytest写用例时候,一定要按照下面的规则去写,否则不符合规则的测试用例是不会执行的

  • 文件名以 test_*.py 文件和*_test.py
  • 以 test_ 开头的函数
  • 以 Test开头的类,不能包含__init__方法
  • 以 test_ 开头的类里面的方法
  • 所有的包 pakege 必项要有__init__.py 文件
版权声明:本文内容由互联网用户自发贡献,该文观点仅代表作者本人。本站仅提供信息存储空间服务,不拥有所有权,不承担相关法律责任。如发现本站有涉嫌侵权/违法违规的内容, 请发送邮件至 举报,一经查实,本站将立刻删除。

发布者:全栈程序员-站长,转载请注明出处:https://javaforall.net/165668.html原文链接:https://javaforall.net

赞 (0)
全栈程序员-站长的头像全栈程序员-站长


相关推荐

  • mysql自定义函数详解_java eval函数

    mysql自定义函数详解_java eval函数存储函数创建存储函数,需要使用CREATEFUNCTION语句,基本语法如下:CREATEFUNCTIONfunc_name([func_parameter])RETURNSTYPE[characteristics…]routine_bodyCREATEFUNCTION为用来创建存储函数的关键字;func_name表示存储函数的名称func_parameter为存储函数的参数列表,参…

    2022年9月8日
  • navicat premium 15 激活码_在线激活

    (navicat premium 15 激活码)JetBrains旗下有多款编译器工具(如:IntelliJ、WebStorm、PyCharm等)在各编程领域几乎都占据了垄断地位。建立在开源IntelliJ平台之上,过去15年以来,JetBrains一直在不断发展和完善这个平台。这个平台可以针对您的开发工作流进行微调并且能够提供…

    2022年3月26日
  • XPS文件转换为PDF不再愁!全新XPS/EPS文档处理神器Aspose.Page来啦!

    XPS文件转换为PDF不再愁!全新XPS/EPS文档处理神器Aspose.Page来啦!近月,针对Aspose.XPS和Aspose.EPS做了一些改动,将其合并成Aspose.Page,同样可以使用现有许可证访问这两种产品的所有功能。Aspose.Page(点击下载)是集成On-PremiseAPI,以.NET和Java应用程序中创建,操作或转换XPS,EPS和PS文件。或使用免费应用程序即时查看或转换文件。功能亮点Aspose.Page允许文档转换。例如,您可以将XPS…

    2022年5月4日
  • 错误813宽带连接解决办法_网站500服务器内部错误

    错误813宽带连接解决办法_网站500服务器内部错误相关链接:服务器IIS安全设置如何完全地重新安装IISIIS无法解析asp文件的原因分析及解决办法HTTP500内部错误解决办法IISFAQ整理一.错误表现IIS5的HTTP500内部服务器错误是我们经常碰到的错误之一,它的主要错误表现就是ASP程序不能浏览但HTM静态网页不受影响。另外当错误发生时,系统事件日志

    2022年8月11日
  • gdb调试python程序(gdb和seggar)

    一、什么是coredump我们经常听到大家说到程序core掉了,需要定位解决,这里说的大部分是指对应程序由于各种异常或者bug导致在运行过程中异常退出或者中止,并且在满足一定条件下(这里为什么说需要满足一定的条件呢?下面会分析)会产生一个叫做core的文件。通常情况下,core文件会包含了程序运行时的内存,寄存器状态,堆栈指针,内存管理信息还有各种函数调用堆栈信息等,我们可以理解为是程序工作当前状…

    2022年4月15日
  • 大型分布式C++框架《二:大包处理过程》

    大型分布式C++框架《二:大包处理过程》

    2021年9月13日

发表回复

您的邮箱地址不会被公开。 必填项已用 * 标注

关注全栈程序员社区公众号