aarch64 poky linux,aarch64pokylinuxgcc:错误::没有这样的文件或目录

aarch64 poky linux,aarch64pokylinuxgcc:错误::没有这样的文件或目录我正在尝试将mlpack包含到我的yocto构建中。如果不启用python绑定,我的配方烘焙成功。但是在构建python绑定时,我得到了以下错误:aarch64-poky-linux-gcc-march=armv8-a-mtune=cortex-a57.cortex-a53–sysroot=/builds/build-h3/tmp/sysroots/h3ulcb-DNDEBUG-g-O…


Jetbrains全系列IDE使用 1年只要46元 售后保障 童叟无欺

我正在尝试将mlpack包含到我的yocto构建中。如果不启用python绑定,我的配方烘焙成功。

但是在构建python绑定时,我得到了以下错误:aarch64-poky-linux-gcc -march=armv8-a -mtune=cortex-a57.cortex-a53

–sysroot=/builds/build-h3/tmp/sysroots/h3ulcb -DNDEBUG -g -O3 -Wall

-Wstrict-prototypes -O2 -pipe -g -feliminate-unused-debug-types -fPIC

-I/builds/build-h3/tmp/sysroots/x86_64-linux/usr/lib/python2.7/site-packages/numpy/core/include

-I/builds/build-h3/tmp/work/aarch64-poky-linux/mlpack/git-r0/build/src/mlpack/bindings/python/

-I/builds/build-h3/tmp/work/aarch64-poky-linux/mlpack/git-r0/git/src

-I/builds/build-h3/tmp/sysroots/h3ulcb/usr/include

-I/builds/build-h3/tmp/sysroots/h3ulcb/usr/include

-I/builds/build-h3/tmp/work/aarch64-poky-linux/mlpack/git-r0/build/src/mlpack/..

-I/builds/build-h3/tmp/sysroots/h3ulcb/usr/include/python2.7 -c /builds/build-h3/tmp/work/aarch64-poky-linux/mlpack/git-r0/build/src/mlpack/bindings/python/mlpack/sparse_coding.cpp

-o build/temp.linux-x86_64-2.7/builds/build-h3/tmp/work/aarch64-poky-linux/mlpack/git-r0/build/src/mlpack/bindings/python/mlpack/sparse_coding.o

-DBINDING_TYPE=BINDING_TYPE_PYX -std=c++11 -march=armv8-a

-mtune=cortex-a57.cortex-a53

–sysroot=/builds/build-h3/tmp/sysroots/h3ulcb -O2 -pipe -g

-feliminate-unused-debug-types -fvisibility-inlines-hidden -Wall

-Wextra -ftemplate-depth=1000 -O3 -fopenmp aarch64-poky-linux-gcc: error: : No such file or directory aarch64-poky-linux-gcc: error: : No such file or directory error: command ‘aarch64-poky-linux-gcc’ failed with exit status 1 src/mlpack/methods/sparse_coding/CMakeFiles/build_pyx_sparse_coding.dir/build.make:60: recipe for target ‘src/mlpack/methods/sparse_coding/CMakeFiles/build_pyx_sparse_coding’ failed make[2]: *** [src/mlpack/methods/sparse_coding/CMakeFiles/build_pyx_sparse_coding] Error 1 make[2]: Leaving directory ‘/builds/build-h3/tmp/work/aarch64-poky-linux/mlpack/git-r0/build’ CMakeFiles/Makefile2:6651: recipe for target ‘src/mlpack/methods/sparse_coding/CMakeFiles/build_pyx_sparse_coding.dir/all’ failed make[1]: *** [src/mlpack/methods/sparse_coding/CMakeFiles/build_pyx_sparse_coding.dir/all] Error 2 make[1]: *** Waiting for unfinished jobs…. /builds/build-h3/tmp/sysroots/x86_64-linux/usr/lib/python2.7/site-packages/setuptools-36.2.7-py2.7.egg/setuptools/dist.py:350: UserWarning: The version specified (‘3.0.x’) is an invalid version, this may not work as expected with newer versions of setuptools, pip, and PyPI. Please see PEP 440 for more details. running build_ext cythoning /builds/build-h3/tmp/work/aarch64-poky-linux/mlpack/git-r0/build/src/mlpack/bindings/python/mlpack/preprocess_split.pyx to /builds/build-h3/tmp/work/aarch64-poky-linux/mlpack/git-r0/build/src/mlpack/bindings/python/mlpack/preprocess_split.cpp building ‘mlpack.preprocess_split’ extension aarch64-poky-linux-gcc

-march=armv8-a -mtune=cortex-a57.cortex-a53

–sysroot=/builds/build-h3/tmp/sysroots/h3ulcb -DNDEBUG -g -O3 -Wall

-Wstrict-prototypes -O2 -pipe -g -feliminate-unused-debug-types -fPIC

-I/builds/build-h3/tmp/sysroots/x86_64-linux/usr/lib/python2.7/site-packages/numpy/core/include

-I/builds/build-h3/tmp/work/aarch64-poky-linux/mlpack/git-r0/build/src/mlpack/bindings/python/

-I/builds/build-h3/tmp/work/aarch64-poky-linux/mlpack/git-r0/git/src

-I/builds/build-h3/tmp/sysroots/h3ulcb/usr/include

-I/builds/build-h3/tmp/sysroots/h3ulcb/usr/include

-I/builds/build-h3/tmp/work/aarch64-poky-linux/mlpack/git-r0/build/src/mlpack/..

-I/builds/build-h3/tmp/sysroots/h3ulcb/usr/include/python2.7 -c /builds/build-h3/tmp/work/aarch64-poky-linux/mlpack/git-r0/build/src/mlpack/bindings/python/mlpack/preprocess_split.cpp

-o build/temp.linux-x86_64-2.7/builds/build-h3/tmp/work/aarch64-poky-linux/mlpack/git-r0/build/src/mlpack/bindings/python/mlpack/preprocess_split.o

-DBINDING_TYPE=BINDING_TYPE_PYX -std=c++11 -march=armv8-a

-mtune=cortex-a57.cortex-a53

–sysroot=/builds/build-h3/tmp/sysroots/h3ulcb -O2 -pipe -g

-feliminate-unused-debug-types -fvisibility-inlines-hidden -Wall

-Wextra -ftemplate-depth=1000 -O3 -fopenmp aarch64-poky-linux-gcc: error: : No such file or directory aarch64-poky-linux-gcc: error: : No such file or directory error: command ‘aarch64-poky-linux-gcc’ failed with exit status 1 src/mlpack/methods/preprocess/CMakeFiles/build_pyx_preprocess_split.dir/build.make:60: recipe for target ‘src/mlpack/methods/preprocess/CMakeFiles/build_pyx_preprocess_split’ failed make[2]: *** [src/mlpack/methods/preprocess/CMakeFiles/build_pyx_preprocess_split] Error 1 make[2]: Leaving directory ‘/builds/build-h3/tmp/work/aarch64-poky-linux/mlpack/git-r0/build’ CMakeFiles/Makefile2:1387: recipe for target ‘src/mlpack/methods/preprocess/CMakeFiles/build_pyx_preprocess_split.dir/all’ failed make[1]: *** [src/mlpack/methods/preprocess/CMakeFiles/build_pyx_preprocess_split.dir/all] Error 2 [ 89%] Linking CXX executable ../../../../bin/generate_pyx_softmax_regression cd /builds/build-h3/tmp/work/aarch64-poky-linux/mlpack/git-r0/build/src/mlpack/methods/softmax_regression && /builds/build-h3/tmp/sysroots/x86_64-linux/usr/bin/cmake -E cmake_link_script CMakeFiles/generate_pyx_softmax_regression.dir/link.txt –verbose=1 /builds/build-h3/tmp/sysroots/x86_64-linux/usr/bin/aarch64-poky-linux/aarch64-poky-linux-g++

-march=armv8-a -mtune=cortex-a57.cortex-a53

–sysroot=/builds/build-h3/tmp/sysroots/h3ulcb -O2 -pipe -g

-feliminate-unused-debug-types -fvisibility-inlines-hidden -Wall

-Wextra -ftemplate-depth=1000 -O3 -fopenmp -O2 -pipe -g

-feliminate-unused-debug-types -O2 -pipe -g

-feliminate-unused-debug-types -fvisibility-inlines-hidden -DNDEBUG

-march=armv8-a -mtune=cortex-a57.cortex-a53

–sysroot=/builds/build-h3/tmp/sysroots/h3ulcb -O2 -pipe -g

-feliminate-unused-debug-types -fvisibility-inlines-hidden -Wl,-O1

-Wl,–hash-style=gnu -Wl,–as-needed -Wl,-O1 -Wl,–hash-style=gnu

-Wl,–as-needed CMakeFiles/generate_pyx_softmax_regression.dir/__/__/bindings/python/generate_pyx_softmax_regression.cpp.o CMakeFiles/generate_pyx_softmax_regression.dir/__/__/bindings/python/print_pyx.cpp.o

-o ../../../../bin/generate_pyx_softmax_regression -rdynamic ../../../../lib/libmlpack.so.2.0 -lrt -larmadillo

-lboost_program_options-mt -lboost_unit_test_framework

-lboost_serialization-mt cd /builds/build-h3/tmp/work/aarch64-poky-linux/mlpack/git-r0/build/src/mlpack/methods/softmax_regression && /builds/build-h3/tmp/sysroots/x86_64-linux/usr/bin/cmake

-DGENERATE_PYX_PROGRAM=/builds/build-h3/tmp/work/aarch64-poky-linux/mlpack/git-r0/build/bin/generate_pyx_softmax_regression

-DPYX_OUTPUT_FILE=/builds/build-h3/tmp/work/aarch64-poky-linux/mlpack/git-r0/build/src/mlpack/bindings/python/mlpack/softmax_regression.pyx

-P /builds/build-h3/tmp/work/aarch64-poky-linux/mlpack/git-r0/git/CMake/GeneratePYX.cmake /builds/build-h3/tmp/work/aarch64-poky-linux/mlpack/git-r0/build/bin/generate_pyx_softmax_regression: /builds/build-h3/tmp/work/aarch64-poky-linux/mlpack/git-r0/build/bin/generate_pyx_softmax_regression: cannot execute binary file make[2]: Leaving directory ‘/builds/build-h3/tmp/work/aarch64-poky-linux/mlpack/git-r0/build’ [ 89%] Built target generate_pyx_softmax_regression [ 89%] Linking CXX executable ../../../../bin/generate_pyx_knn cd /builds/build-h3/tmp/work/aarch64-poky-linux/mlpack/git-r0/build/src/mlpack/methods/neighbor_search && /builds/build-h3/tmp/sysroots/x86_64-linux/usr/bin/cmake -E cmake_link_script CMakeFiles/generate_pyx_knn.dir/link.txt –verbose=1 /builds/build-h3/tmp/sysroots/x86_64-linux/usr/bin/aarch64-poky-linux/aarch64-poky-linux-g++

-march=armv8-a -mtune=cortex-a57.cortex-a53

–sysroot=/builds/build-h3/tmp/sysroots/h3ulcb -O2 -pipe -g

-feliminate-unused-debug-types -fvisibility-inlines-hidden -Wall

-Wextra -ftemplate-depth=1000 -O3 -fopenmp -O2 -pipe -g

-feliminate-unused-debug-types -O2 -pipe -g

-feliminate-unused-debug-types -fvisibility-inlines-hidden -DNDEBUG

-march=armv8-a -mtune=cortex-a57.cortex-a53

–sysroot=/builds/build-h3/tmp/sysroots/h3ulcb -O2 -pipe -g

-feliminate-unused-debug-types -fvisibility-inlines-hidden -Wl,-O1

-Wl,–hash-style=gnu -Wl,–as-needed -Wl,-O1 -Wl,–hash-style=gnu

-Wl,–as-needed CMakeFiles/generate_pyx_knn.dir/__/__/bindings/python/generate_pyx_knn.cpp.o CMakeFiles/generate_pyx_knn.dir/__/__/bindings/python/print_pyx.cpp.o

-o ../../../../bin/generate_pyx_knn -rdynamic ../../../../lib/libmlpack.so.2.0 -lrt -larmadillo

-lboost_program_options-mt -lboost_unit_test_framework

-lboost_serialization-mt cd /builds/build-h3/tmp/work/aarch64-poky-linux/mlpack/git-r0/build/src/mlpack/methods/neighbor_search && /builds/build-h3/tmp/sysroots/x86_64-linux/usr/bin/cmake

-DGENERATE_PYX_PROGRAM=/builds/build-h3/tmp/work/aarch64-poky-linux/mlpack/git-r0/build/bin/generate_pyx_knn

-DPYX_OUTPUT_FILE=/builds/build-h3/tmp/work/aarch64-poky-linux/mlpack/git-r0/build/src/mlpack/bindings/python/mlpack/knn.pyx

-P /builds/build-h3/tmp/work/aarch64-poky-linux/mlpack/git-r0/git/CMake/GeneratePYX.cmake /builds/build-h3/tmp/work/aarch64-poky-linux/mlpack/git-r0/build/bin/generate_pyx_knn: /builds/build-h3/tmp/work/aarch64-poky-linux/mlpack/git-r0/build/bin/generate_pyx_knn: cannot execute binary file make[2]: Leaving directory ‘/builds/build-h3/tmp/work/aarch64-poky-linux/mlpack/git-r0/build’ [ 89%] Built target generate_pyx_knn [ 89%] Linking CXX executable ../../../../bin/generate_pyx_kfn cd /builds/build-h3/tmp/work/aarch64-poky-linux/mlpack/git-r0/build/src/mlpack/methods/neighbor_search && /builds/build-h3/tmp/sysroots/x86_64-linux/usr/bin/cmake -E cmake_link_script CMakeFiles/generate_pyx_kfn.dir/link.txt –verbose=1 /builds/build-h3/tmp/sysroots/x86_64-linux/usr/bin/aarch64-poky-linux/aarch64-poky-linux-g++

-march=armv8-a -mtune=cortex-a57.cortex-a53

–sysroot=/builds/build-h3/tmp/sysroots/h3ulcb -O2 -pipe -g

-feliminate-unused-debug-types -fvisibility-inlines-hidden -Wall

-Wextra -ftemplate-depth=1000 -O3 -fopenmp -O2 -pipe -g

-feliminate-unused-debug-types -O2 -pipe -g

-feliminate-unused-debug-types -fvisibility-inlines-hidden -DNDEBUG

-march=armv8-a -mtune=cortex-a57.cortex-a53

–sysroot=/builds/build-h3/tmp/sysroots/h3ulcb -O2 -pipe -g

-feliminate-unused-debug-types -fvisibility-inlines-hidden -Wl,-O1

-Wl,–hash-style=gnu -Wl,–as-needed -Wl,-O1 -Wl,–hash-style=gnu

-Wl,–as-needed CMakeFiles/generate_pyx_kfn.dir/__/__/bindings/python/generate_pyx_kfn.cpp.o CMakeFiles/generate_pyx_kfn.dir/__/__/bindings/python/print_pyx.cpp.o

-o ../../../../bin/generate_pyx_kfn -rdynamic ../../../../lib/libmlpack.so.2.0 -lrt -larmadillo

-lboost_program_options-mt -lboost_unit_test_framework

-lboost_serialization-mt cd /builds/build-h3/tmp/work/aarch64-poky-linux/mlpack/git-r0/build/src/mlpack/methods/neighbor_search && /builds/build-h3/tmp/sysroots/x86_64-linux/usr/bin/cmake

-DGENERATE_PYX_PROGRAM=/builds/build-h3/tmp/work/aarch64-poky-linux/mlpack/git-r0/build/bin/generate_pyx_kfn

-DPYX_OUTPUT_FILE=/builds/build-h3/tmp/work/aarch64-poky-linux/mlpack/git-r0/build/src/mlpack/bindings/python/mlpack/kfn.pyx

-P /builds/build-h3/tmp/work/aarch64-poky-linux/mlpack/git-r0/git/CMake/GeneratePYX.cmake /builds/build-h3/tmp/work/aarch64-poky-linux/mlpack/git-r0/build/bin/generate_pyx_kfn: /builds/build-h3/tmp/work/aarch64-poky-linux/mlpack/git-r0/build/bin/generate_pyx_kfn: cannot execute binary file make[2]: Leaving directory ‘/builds/build-h3/tmp/work/aarch64-poky-linux/mlpack/git-r0/build’ [ 89%] Built target generate_pyx_kfn [ 89%] Linking CXX executable ../../../../bin/generate_pyx_krann cd /builds/build-h3/tmp/work/aarch64-poky-linux/mlpack/git-r0/build/src/mlpack/methods/rann && /builds/build-h3/tmp/sysroots/x86_64-linux/usr/bin/cmake -E cmake_link_script CMakeFiles/generate_pyx_krann.dir/link.txt

–verbose=1 /builds/build-h3/tmp/sysroots/x86_64-linux/usr/bin/aarch64-poky-linux/aarch64-poky-linux-g++

-march=armv8-a -mtune=cortex-a57.cortex-a53

–sysroot=/builds/build-h3/tmp/sysroots/h3ulcb -O2 -pipe -g

-feliminate-unused-debug-types -fvisibility-inlines-hidden -Wall

-Wextra -ftemplate-depth=1000 -O3 -fopenmp -O2 -pipe -g

-feliminate-unused-debug-types -O2 -pipe -g

-feliminate-unused-debug-types -fvisibility-inlines-hidden -DNDEBUG

-march=armv8-a -mtune=cortex-a57.cortex-a53

–sysroot=/builds/build-h3/tmp/sysroots/h3ulcb -O2 -pipe -g

-feliminate-unused-debug-types -fvisibility-inlines-hidden -Wl,-O1

-Wl,–hash-style=gnu -Wl,–as-needed -Wl,-O1 -Wl,–hash-style=gnu

-Wl,–as-needed CMakeFiles/generate_pyx_krann.dir/__/__/bindings/python/generate_pyx_krann.cpp.o CMakeFiles/generate_pyx_krann.dir/__/__/bindings/python/print_pyx.cpp.o

-o ../../../../bin/generate_pyx_krann -rdynamic ../../../../lib/libmlpack.so.2.0 -lrt -larmadillo

-lboost_program_options-mt -lboost_unit_test_framework

-lboost_serialization-mt cd /builds/build-h3/tmp/work/aarch64-poky-linux/mlpack/git-r0/build/src/mlpack/methods/rann && /builds/build-h3/tmp/sysroots/x86_64-linux/usr/bin/cmake

-DGENERATE_PYX_PROGRAM=/builds/build-h3/tmp/work/aarch64-poky-linux/mlpack/git-r0/build/bin/generate_pyx_krann

-DPYX_OUTPUT_FILE=/builds/build-h3/tmp/work/aarch64-poky-linux/mlpack/git-r0/build/src/mlpack/bindings/python/mlpack/krann.pyx

-P /builds/build-h3/tmp/work/aarch64-poky-linux/mlpack/git-r0/git/CMake/GeneratePYX.cmake /builds/build-h3/tmp/work/aarch64-poky-linux/mlpack/git-r0/build/bin/generate_pyx_krann: /builds/build-h3/tmp/work/aarch64-poky-linux/mlpack/git-r0/build/bin/generate_pyx_krann: cannot execute binary file make[2]: Leaving directory ‘/builds/build-h3/tmp/work/aarch64-poky-linux/mlpack/git-r0/build’ [ 89%] Built target generate_pyx_krann make[1]: Leaving directory ‘/builds/build-h3/tmp/work/aarch64-poky-linux/mlpack/git-r0/build’ Makefile:141: recipe for target ‘all’ failed make: *** [all] Error 2 ERROR: oe_runmake failed ERROR: Function failed: do_compile (log file is located at /builds/build-h3/tmp/work/aarch64-poky-linux/mlpack/git-r0/temp/log.do_compile.17361)

我的食谱如下:

^{pr2}$

我的食谱里还需要加些什么吗?

或者构建环境缺少什么?在

任何建议都会有帮助。在

版权声明:本文内容由互联网用户自发贡献,该文观点仅代表作者本人。本站仅提供信息存储空间服务,不拥有所有权,不承担相关法律责任。如发现本站有涉嫌侵权/违法违规的内容, 请发送邮件至 举报,一经查实,本站将立刻删除。

发布者:全栈程序员-站长,转载请注明出处:https://javaforall.net/183792.html原文链接:https://javaforall.net

赞 (0)
全栈程序员-站长的头像全栈程序员-站长


相关推荐

  • risc系统服务器,RISC架构三款处理器

    risc系统服务器,RISC架构三款处理器富士通在去年8月份的HotChips24大会上发布了其Sparc架构的16核处理器Sparc64-X,与此同时,甲骨文也发布了同样为Sparc架构的16核心处理器SparcT5,IBM的Power7+也是在此次大会上发布的。HotChips24三款CPU主题演讲IBM的Power7+采用的32nm支持工艺,8核心,最高主频超过5GHz,已经在IBM大型机ZzEnterpriseEC1…

    2022年10月22日
  • Cannot return from outside a function or method.

    Cannot return from outside a function or method.Cannot return from outside a function or method.

    2022年4月25日
  • java bean有什么好处,使用Java Bean有什么好处?

    java bean有什么好处,使用Java Bean有什么好处?IbelieveIunderstandwhatJavaBeansare:Javaclass(es)whichcontainano-argconstructor,areserializable,andexposetheirfieldswithgettersandsetters.DoesaJavaBeanhavetoexposeallof…

    2022年7月7日
  • java 分布式计算框架_java分布式系统框架的分类「建议收藏」

    java 分布式计算框架_java分布式系统框架的分类「建议收藏」鲁班学院java架构师成长路线随着电商行业的崛起,越来越多的人为了省事更习惯网购,今天我们就来熟悉Java分布式系统中的Dubbo,Dubbo就是来解决Java分布式系统中间的子系统之间相互调用相互协作的一个框架。在Dubbo之前就有一个Java分布式系统框架RPC(远程过程调用),多个子系统之间需要实现相互调用必须要借助网络来表达调用的语义和传达调用的数据,RPC采用客户机/服务器模式。请求程序…

    2022年5月31日
  • cover letter and response letter

    cover letter and response letter在此之前先区分投稿CoverLetter,修改稿CoverLetter和ResponseLetter,前两个是写给编辑或者TopicEditor,后者是写给Reviwer。一般来说在提交稿件时我们会附带一封CoverLetter主要是一些客套话跟编辑说的。修改稿CoverLetterDearProfessor***:(***指的是负责你论文的编辑,不知道名字就写Editor)    Onbehalfofmyco-authors,we

    2022年6月2日
  • c语言入门教程–-17结构体

    c语言入门教程–-17结构体

    2021年3月12日

发表回复

您的邮箱地址不会被公开。 必填项已用 * 标注

关注全栈程序员社区公众号